=== Go 1.27.1 full repository race ===
ok  	git.yuntuo.hk/k2safe/go-omni	2.110s
ok  	git.yuntuo.hk/k2safe/go-omni/app	3.749s
ok  	git.yuntuo.hk/k2safe/go-omni/audit	(cached)
ok  	git.yuntuo.hk/k2safe/go-omni/auth	2.176s
ok  	git.yuntuo.hk/k2safe/go-omni/cache	(cached)
ok  	git.yuntuo.hk/k2safe/go-omni/cache/redis	(cached)
ok  	git.yuntuo.hk/k2safe/go-omni/cmd/go-omni	4.648s
ok  	git.yuntuo.hk/k2safe/go-omni/cmd/go-omni/apigen	29.880s
ok  	git.yuntuo.hk/k2safe/go-omni/cmd/go-omni/scaffold	(cached)
ok  	git.yuntuo.hk/k2safe/go-omni/config	2.829s
ok  	git.yuntuo.hk/k2safe/go-omni/contract	(cached)
ok  	git.yuntuo.hk/k2safe/go-omni/copyx	(cached)
ok  	git.yuntuo.hk/k2safe/go-omni/cors	(cached)
ok  	git.yuntuo.hk/k2safe/go-omni/database	2.260s
ok  	git.yuntuo.hk/k2safe/go-omni/database/gormx	(cached)
ok  	git.yuntuo.hk/k2safe/go-omni/database/migrate	(cached)
ok  	git.yuntuo.hk/k2safe/go-omni/database/mysql	(cached)
ok  	git.yuntuo.hk/k2safe/go-omni/errors	3.366s
?   	git.yuntuo.hk/k2safe/go-omni/examples/basic	[no test files]
?   	git.yuntuo.hk/k2safe/go-omni/examples/compatibility	[no test files]
?   	git.yuntuo.hk/k2safe/go-omni/examples/compatibility/ids	[no test files]
ok  	git.yuntuo.hk/k2safe/go-omni/examples/configuration	3.039s
ok  	git.yuntuo.hk/k2safe/go-omni/examples/copying	(cached)
?   	git.yuntuo.hk/k2safe/go-omni/examples/cors	[no test files]
?   	git.yuntuo.hk/k2safe/go-omni/examples/developerTools	[no test files]
ok  	git.yuntuo.hk/k2safe/go-omni/examples/httpClient	(cached)
ok  	git.yuntuo.hk/k2safe/go-omni/examples/i18n	3.686s
ok  	git.yuntuo.hk/k2safe/go-omni/examples/modules	4.007s
ok  	git.yuntuo.hk/k2safe/go-omni/examples/platform	4.383s
ok  	git.yuntuo.hk/k2safe/go-omni/examples/reference	4.158s
?   	git.yuntuo.hk/k2safe/go-omni/examples/reference/handler	[no test files]
?   	git.yuntuo.hk/k2safe/go-omni/examples/reference/model	[no test files]
ok  	git.yuntuo.hk/k2safe/go-omni/examples/reference/repository	(cached)
?   	git.yuntuo.hk/k2safe/go-omni/examples/reference/service	[no test files]
?   	git.yuntuo.hk/k2safe/go-omni/examples/transactions	[no test files]
ok  	git.yuntuo.hk/k2safe/go-omni/health	3.842s
ok  	git.yuntuo.hk/k2safe/go-omni/httpc	(cached)
ok  	git.yuntuo.hk/k2safe/go-omni/httpx	3.850s
ok  	git.yuntuo.hk/k2safe/go-omni/i18n	3.384s
?   	git.yuntuo.hk/k2safe/go-omni/i18n/browser	[no test files]
ok  	git.yuntuo.hk/k2safe/go-omni/i18n/errori18n	3.169s
ok  	git.yuntuo.hk/k2safe/go-omni/i18n/httpi18n	3.277s
ok  	git.yuntuo.hk/k2safe/go-omni/i18n/i18ntool	3.480s
?   	git.yuntuo.hk/k2safe/go-omni/internal/configdiag	[no test files]
ok  	git.yuntuo.hk/k2safe/go-omni/internal/perfcheck	3.467s
?   	git.yuntuo.hk/k2safe/go-omni/internal/storagefixture	[no test files]
?   	git.yuntuo.hk/k2safe/go-omni/internal/testutil	[no test files]
ok  	git.yuntuo.hk/k2safe/go-omni/lifecycle	(cached)
ok  	git.yuntuo.hk/k2safe/go-omni/logx	(cached)
ok  	git.yuntuo.hk/k2safe/go-omni/metrics	3.470s
ok  	git.yuntuo.hk/k2safe/go-omni/middleware	3.697s
ok  	git.yuntuo.hk/k2safe/go-omni/middleware/redis	3.573s
ok  	git.yuntuo.hk/k2safe/go-omni/openapi	3.448s
ok  	git.yuntuo.hk/k2safe/go-omni/pagination	(cached)
?   	git.yuntuo.hk/k2safe/go-omni/queue	[no test files]
ok  	git.yuntuo.hk/k2safe/go-omni/queue/redis	(cached)
ok  	git.yuntuo.hk/k2safe/go-omni/resilience	(cached)
ok  	git.yuntuo.hk/k2safe/go-omni/response	3.564s
?   	git.yuntuo.hk/k2safe/go-omni/scripts/corsBrowser	[no test files]
ok  	git.yuntuo.hk/k2safe/go-omni/storage	(cached)
ok  	git.yuntuo.hk/k2safe/go-omni/storage/local	(cached)
ok  	git.yuntuo.hk/k2safe/go-omni/storage/oss	(cached)
ok  	git.yuntuo.hk/k2safe/go-omni/storage/s3	(cached)
?   	git.yuntuo.hk/k2safe/go-omni/storage/storagetest	[no test files]
ok  	git.yuntuo.hk/k2safe/go-omni/task	(cached)
ok  	git.yuntuo.hk/k2safe/go-omni/telemetry	2.867s
ok  	git.yuntuo.hk/k2safe/go-omni/transport	3.380s
ok  	git.yuntuo.hk/k2safe/go-omni/transport/http2	(cached)
?   	git.yuntuo.hk/k2safe/go-omni/transport/internal/routing	[no test files]
ok  	git.yuntuo.hk/k2safe/go-omni/transport/native	4.302s
ok  	git.yuntuo.hk/k2safe/go-omni/transport/nethttp	3.669s
?   	git.yuntuo.hk/k2safe/go-omni/transport/transporttest	[no test files]
?   	git.yuntuo.hk/k2safe/go-omni/validate	[no test files]

=== Go 1.27.1 vet ===
(no diagnostics)

=== Go 1.27.1 build ===
(no diagnostics)

=== Generated consumers ===
=== RUN   TestErrorInheritanceConsumer
--- PASS: TestErrorInheritanceConsumer (4.65s)
=== RUN   TestErrorParamsConsumer
--- PASS: TestErrorParamsConsumer (3.93s)
=== RUN   TestI18nGeneratedConsumer
--- PASS: TestI18nGeneratedConsumer (2.18s)
PASS
ok  	git.yuntuo.hk/k2safe/go-omni/cmd/go-omni/apigen	12.002s

=== Go 1.22 full repository: TWO KNOWN FAILURES ===
ok  	git.yuntuo.hk/k2safe/go-omni	0.601s
ok  	git.yuntuo.hk/k2safe/go-omni/app	3.748s
ok  	git.yuntuo.hk/k2safe/go-omni/audit	2.939s
ok  	git.yuntuo.hk/k2safe/go-omni/auth	0.770s
ok  	git.yuntuo.hk/k2safe/go-omni/cache	1.306s
ok  	git.yuntuo.hk/k2safe/go-omni/cache/redis	2.414s
ok  	git.yuntuo.hk/k2safe/go-omni/cmd/go-omni	6.033s
?   	git.yuntuo.hk/k2safe/go-omni/examples/basic	[no test files]
?   	git.yuntuo.hk/k2safe/go-omni/examples/compatibility	[no test files]
?   	git.yuntuo.hk/k2safe/go-omni/examples/compatibility/ids	[no test files]
?   	git.yuntuo.hk/k2safe/go-omni/examples/cors	[no test files]
?   	git.yuntuo.hk/k2safe/go-omni/examples/developerTools	[no test files]
?   	git.yuntuo.hk/k2safe/go-omni/examples/reference/handler	[no test files]
?   	git.yuntuo.hk/k2safe/go-omni/examples/reference/model	[no test files]
?   	git.yuntuo.hk/k2safe/go-omni/examples/reference/service	[no test files]
?   	git.yuntuo.hk/k2safe/go-omni/examples/transactions	[no test files]
?   	git.yuntuo.hk/k2safe/go-omni/i18n/browser	[no test files]
?   	git.yuntuo.hk/k2safe/go-omni/internal/configdiag	[no test files]
?   	git.yuntuo.hk/k2safe/go-omni/internal/storagefixture	[no test files]
?   	git.yuntuo.hk/k2safe/go-omni/internal/testutil	[no test files]
?   	git.yuntuo.hk/k2safe/go-omni/queue	[no test files]
?   	git.yuntuo.hk/k2safe/go-omni/scripts/corsBrowser	[no test files]
?   	git.yuntuo.hk/k2safe/go-omni/storage/storagetest	[no test files]
?   	git.yuntuo.hk/k2safe/go-omni/transport/internal/routing	[no test files]
?   	git.yuntuo.hk/k2safe/go-omni/transport/transporttest	[no test files]
?   	git.yuntuo.hk/k2safe/go-omni/validate	[no test files]
--- FAIL: TestWorkspaceSharedGoCatalog (0.24s)
    workspaceCatalog_test.go:36: workspace catalog example.com/catalogs/internal/apierrors.Catalog: build failed (exit status 1); check module dependencies and func() errors.Catalog signature
FAIL
FAIL	git.yuntuo.hk/k2safe/go-omni/cmd/go-omni/apigen	33.292s
ok  	git.yuntuo.hk/k2safe/go-omni/cmd/go-omni/scaffold	4.926s
ok  	git.yuntuo.hk/k2safe/go-omni/config	4.921s
--- FAIL: TestBodyPolicyPropagatesOuterLimit (0.00s)
    policy_test.go:32: limit 1: expected 413, got INVALID_REQUEST: request parameters are invalid: unterminated object
FAIL
FAIL	git.yuntuo.hk/k2safe/go-omni/contract	5.102s
ok  	git.yuntuo.hk/k2safe/go-omni/copyx	4.564s
ok  	git.yuntuo.hk/k2safe/go-omni/cors	5.632s
ok  	git.yuntuo.hk/k2safe/go-omni/database	5.107s
ok  	git.yuntuo.hk/k2safe/go-omni/database/gormx	5.540s
ok  	git.yuntuo.hk/k2safe/go-omni/database/migrate	4.580s
ok  	git.yuntuo.hk/k2safe/go-omni/database/mysql	2.955s
ok  	git.yuntuo.hk/k2safe/go-omni/errors	3.089s
ok  	git.yuntuo.hk/k2safe/go-omni/examples/configuration	3.126s
ok  	git.yuntuo.hk/k2safe/go-omni/examples/copying	3.375s
ok  	git.yuntuo.hk/k2safe/go-omni/examples/httpClient	3.375s
ok  	git.yuntuo.hk/k2safe/go-omni/examples/i18n	4.191s
ok  	git.yuntuo.hk/k2safe/go-omni/examples/modules	3.972s
ok  	git.yuntuo.hk/k2safe/go-omni/examples/platform	3.265s
ok  	git.yuntuo.hk/k2safe/go-omni/examples/reference	3.128s
ok  	git.yuntuo.hk/k2safe/go-omni/examples/reference/repository	3.181s
ok  	git.yuntuo.hk/k2safe/go-omni/health	3.212s
ok  	git.yuntuo.hk/k2safe/go-omni/httpc	3.472s
ok  	git.yuntuo.hk/k2safe/go-omni/httpx	3.782s
ok  	git.yuntuo.hk/k2safe/go-omni/i18n	3.603s
ok  	git.yuntuo.hk/k2safe/go-omni/i18n/errori18n	3.390s
ok  	git.yuntuo.hk/k2safe/go-omni/i18n/httpi18n	3.279s
ok  	git.yuntuo.hk/k2safe/go-omni/i18n/i18ntool	2.712s
ok  	git.yuntuo.hk/k2safe/go-omni/internal/perfcheck	2.535s
ok  	git.yuntuo.hk/k2safe/go-omni/lifecycle	2.721s
ok  	git.yuntuo.hk/k2safe/go-omni/logx	2.725s
ok  	git.yuntuo.hk/k2safe/go-omni/metrics	2.734s
ok  	git.yuntuo.hk/k2safe/go-omni/middleware	2.605s
ok  	git.yuntuo.hk/k2safe/go-omni/middleware/redis	2.344s
ok  	git.yuntuo.hk/k2safe/go-omni/openapi	1.869s
ok  	git.yuntuo.hk/k2safe/go-omni/pagination	2.125s
ok  	git.yuntuo.hk/k2safe/go-omni/queue/redis	2.273s
ok  	git.yuntuo.hk/k2safe/go-omni/resilience	2.439s
ok  	git.yuntuo.hk/k2safe/go-omni/response	2.687s
ok  	git.yuntuo.hk/k2safe/go-omni/storage	3.068s
ok  	git.yuntuo.hk/k2safe/go-omni/storage/local	3.291s
ok  	git.yuntuo.hk/k2safe/go-omni/storage/oss	3.284s
ok  	git.yuntuo.hk/k2safe/go-omni/storage/s3	0.837s
ok  	git.yuntuo.hk/k2safe/go-omni/task	1.183s
ok  	git.yuntuo.hk/k2safe/go-omni/telemetry	1.391s
ok  	git.yuntuo.hk/k2safe/go-omni/transport	0.320s
ok  	git.yuntuo.hk/k2safe/go-omni/transport/http2	12.096s
ok  	git.yuntuo.hk/k2safe/go-omni/transport/native	2.570s
ok  	git.yuntuo.hk/k2safe/go-omni/transport/nethttp	1.642s
FAIL

=== Go 1.22 feature and integration packages ===
?   	git.yuntuo.hk/k2safe/go-omni/i18n/browser	[no test files]
ok  	git.yuntuo.hk/k2safe/go-omni/i18n	0.894s
ok  	git.yuntuo.hk/k2safe/go-omni/i18n/errori18n	(cached)
ok  	git.yuntuo.hk/k2safe/go-omni/i18n/httpi18n	(cached)
ok  	git.yuntuo.hk/k2safe/go-omni/i18n/i18ntool	(cached)
ok  	git.yuntuo.hk/k2safe/go-omni/app	(cached)
ok  	git.yuntuo.hk/k2safe/go-omni/errors	(cached)
ok  	git.yuntuo.hk/k2safe/go-omni/response	(cached)
ok  	git.yuntuo.hk/k2safe/go-omni/httpx	(cached)
ok  	git.yuntuo.hk/k2safe/go-omni/config	(cached)
ok  	git.yuntuo.hk/k2safe/go-omni/cmd/go-omni	3.552s
ok  	git.yuntuo.hk/k2safe/go-omni/examples/i18n	(cached)

=== Go 1.22 i18n generated consumer ===
=== RUN   TestI18nTranslationMetadataAndVersionBoundary
--- PASS: TestI18nTranslationMetadataAndVersionBoundary (0.01s)
=== RUN   TestI18nGeneratedConsumer
--- PASS: TestI18nGeneratedConsumer (2.43s)
PASS
ok  	git.yuntuo.hk/k2safe/go-omni/cmd/go-omni/apigen	2.866s

=== CLDR / Go-browser / TypeScript conformance ===
=== RUN   TestPinnedCLDRSamples
    plural_test.go:52: validated 5777 upstream cardinal samples
--- PASS: TestPinnedCLDRSamples (0.00s)
=== RUN   TestSourceLocaleCanBeFallbackOnly
=== RUN   TestSourceLocaleCanBeFallbackOnly/fr
=== RUN   TestSourceLocaleCanBeFallbackOnly/cmn
=== RUN   TestSourceLocaleCanBeFallbackOnly/x-example
--- PASS: TestSourceLocaleCanBeFallbackOnly (0.10s)
    --- PASS: TestSourceLocaleCanBeFallbackOnly/fr (0.04s)
    --- PASS: TestSourceLocaleCanBeFallbackOnly/cmn (0.03s)
    --- PASS: TestSourceLocaleCanBeFallbackOnly/x-example (0.03s)
=== RUN   TestBrowserConformance
--- PASS: TestBrowserConformance (0.16s)
=== RUN   TestTypeScriptConsumer
--- PASS: TestTypeScriptConsumer (0.55s)
PASS
ok  	git.yuntuo.hk/k2safe/go-omni/i18n	1.325s

=== Bounded JSON fuzz ===
fuzz: elapsed: 0s, gathering baseline coverage: 0/1 completed
fuzz: elapsed: 0s, gathering baseline coverage: 1/1 completed, now fuzzing with 12 workers
fuzz: elapsed: 3s, execs: 264525 (88141/sec), new interesting: 179 (total: 180)
fuzz: elapsed: 6s, execs: 264525 (0/sec), new interesting: 179 (total: 180)
fuzz: elapsed: 9s, execs: 413057 (49511/sec), new interesting: 186 (total: 187)
fuzz: elapsed: 11s, execs: 419121 (2995/sec), new interesting: 192 (total: 193)
PASS
ok  	git.yuntuo.hk/k2safe/go-omni/i18n	11.341s

=== Development-machine benchmark ===
goos: darwin
goarch: arm64
pkg: git.yuntuo.hk/k2safe/go-omni/i18n
cpu: Apple M2 Max
BenchmarkRender-12    	  623985	      3753 ns/op	    1040 B/op	      27 allocs/op
PASS
ok  	git.yuntuo.hk/k2safe/go-omni/i18n	2.745s

=== Final changed-package race including TypeScript ===
ok  	git.yuntuo.hk/k2safe/go-omni/i18n	2.518s
?   	git.yuntuo.hk/k2safe/go-omni/i18n/browser	[no test files]
ok  	git.yuntuo.hk/k2safe/go-omni/i18n/errori18n	(cached)
ok  	git.yuntuo.hk/k2safe/go-omni/i18n/httpi18n	(cached)
ok  	git.yuntuo.hk/k2safe/go-omni/i18n/i18ntool	(cached)
ok  	git.yuntuo.hk/k2safe/go-omni/cmd/go-omni	4.929s
ok  	git.yuntuo.hk/k2safe/go-omni/examples/i18n	(cached)
